Reaction Details
TargetProstaglandin D2 receptor
LigandBDBM50350366
Substrate/Competitorn/a
Meas. Tech.ChEMBL_761111 (CHEMBL1815365)
Ki 4.8±n/a nM
Citation Iwahashi, MShimabukuro, AOnoda, TMatsunaga, YOkada, YMatsumoto, RNambu, FNakai, HToda, M Discovery of selective indole-based prostaglandin D2 receptor antagonist. Bioorg Med Chem19:4574-88 (2011) 
 
Prostaglandin D2 receptor
Name:Prostaglandin D2 receptor
Type:PROTEIN
Mol. Mass.:40018.63
Organism:Mus musculus
Description:ChEMBL_788408
Residue:357
BDBM50350366
NameBDBM50350366
Synonyms:CHEMBL1813287
TypeSmall organic molecule
Emp. Form.C30H30N2O4
Mol. Mass.482.5702
SMILESCCN1[C@@H](COc2ccc(C(=O)n3c(C)c(CC(O)=O)c4ccccc34)c(C)c2)Cc2ccccc12