Reaction Details
TargetProstacyclin receptor
LigandBDBM50350355
Substrate/Competitorn/a
Meas. Tech.ChEMBL_761110 (CHEMBL1815364)
Ki 160±n/a nM
Citation Iwahashi, MShimabukuro, AOnoda, TMatsunaga, YOkada, YMatsumoto, RNambu, FNakai, HToda, M Discovery of selective indole-based prostaglandin D2 receptor antagonist. Bioorg Med Chem19:4574-88 (2011) 
 
Prostacyclin receptor
Name:Prostacyclin receptor
Type:G Protein-Coupled Receptor (GPCR)
Mol. Mass.:40968.22
Organism:Homo sapiens (Human)
Description:The membranes prepared from human platelet were used in binding assay.
Residue:386
BDBM50350355
NameBDBM50350355
Synonyms:CHEMBL1813278
TypeSmall organic molecule
Emp. Form.C29H27FN2O5
Mol. Mass.502.5335
SMILESCN1C[C@@H](COc2ccc(cc2C)C(=O)n2c(C)c(CC(O)=O)c3cc(F)ccc23)Oc2ccccc12