Reaction Details
TargetProstaglandin D2 receptor
LigandBDBM50350374
Substrate/Competitorn/a
Meas. Tech.ChEMBL_761111 (CHEMBL1815365)
Ki 240±n/a nM
Citation Iwahashi, MShimabukuro, AOnoda, TMatsunaga, YOkada, YMatsumoto, RNambu, FNakai, HToda, M Discovery of selective indole-based prostaglandin D2 receptor antagonist. Bioorg Med Chem19:4574-88 (2011) 
 
Prostaglandin D2 receptor
Name:Prostaglandin D2 receptor
Type:PROTEIN
Mol. Mass.:40018.63
Organism:Mus musculus
Description:ChEMBL_788408
Residue:357
BDBM50350374
NameBDBM50350374
Synonyms:CHEMBL1813125
TypeSmall organic molecule
Emp. Form.C28H25FN2O5
Mol. Mass.488.5069
SMILESCN1C[C@@H](COc2ccc(cc2F)C(=O)n2c(C)c(CC(O)=O)c3ccccc23)Oc2ccccc12