Reaction Details
TargetAurora kinase B
LigandBDBM50350424
Substrate/Competitorn/a
Meas. Tech.ChEMBL_762495 (CHEMBL1816865)
IC50 500±n/a nM
Citation Ebada, SSSchulz, BWray, VTotzke, FKubbutat, MHMüller, WEHamacher, AKassack, MULin, WProksch, P Arthrinins A-D: novel diterpenoids and further constituents from the sponge derived fungus Arthrinium sp. Bioorg Med Chem19:4644-51 (2011) 
 
Aurora kinase B
Name:Aurora kinase B
Type:Protein
Mol. Mass.:39327.72
Organism:Homo sapiens (Human)
Description:Q96GD4
Residue:344
BDBM50350424
NameBDBM50350424
Synonyms:CHEMBL454440
TypeSmall organic molecule
Emp. Form.C14H10O6
Mol. Mass.274.2256
SMILESCc1c(O)c(O)cc2oc3cc(O)cc(O)c3c(=O)c12