Reaction Details
TargetRAC-alpha serine/threonine-protein kinase
LigandBDBM50350424
Substrate/Competitorn/a
Meas. Tech.ChEMBL_762492 (CHEMBL1816862)
IC50>100000±n/a nM
Citation Ebada, SSSchulz, BWray, VTotzke, FKubbutat, MHMüller, WEHamacher, AKassack, MULin, WProksch, P Arthrinins A-D: novel diterpenoids and further constituents from the sponge derived fungus Arthrinium sp. Bioorg Med Chem19:4644-51 (2011) 
 
RAC-alpha serine/threonine-protein kinase
Name:RAC-alpha serine/threonine-protein kinase
Type:Enzyme
Mol. Mass.:55681.25
Organism:Homo sapiens (Human)
Description:P31749
Residue:480
BDBM50350424
NameBDBM50350424
Synonyms:CHEMBL454440
TypeSmall organic molecule
Emp. Form.C14H10O6
Mol. Mass.274.2256
SMILESCc1c(O)c(O)cc2oc3cc(O)cc(O)c3c(=O)c12