Reaction Details
TargetSerine/threonine-protein kinase Nek6
LigandBDBM50350423
Substrate/Competitorn/a
Meas. Tech.ChEMBL_762502 (CHEMBL1816872)
IC50>100000±n/a nM
Citation Ebada, SSSchulz, BWray, VTotzke, FKubbutat, MHMüller, WEHamacher, AKassack, MULin, WProksch, P Arthrinins A-D: novel diterpenoids and further constituents from the sponge derived fungus Arthrinium sp. Bioorg Med Chem19:4644-51 (2011) 
 
Serine/threonine-protein kinase Nek6
Name:Serine/threonine-protein kinase Nek6
Type:PROTEIN
Mol. Mass.:35724.53
Organism:Homo sapiens (Human)
Description:ChEMBL_1446777
Residue:313
BDBM50350423
NameBDBM50350423
Synonyms:CHEMBL466154
TypeSmall organic molecule
Emp. Form.C14H10O5
Mol. Mass.258.2262
SMILESCc1cc(O)cc2oc3cc(O)cc(O)c3c(=O)c12