Reaction Details
TargetPotassium voltage-gated channel subfamily H member 2
LigandBDBM21278
Substrate/Competitorn/a
Meas. Tech.ChEMBL_762537 (CHEMBL1816994)
IC50 2790±n/a nM
Citation Sasmal, PKTalwar, RSwetha, JBalasubrahmanyam, DVenkatesham, BRawoof, KANeelima Devi, BJadhav, VPKhan, SKMohan, PSrinivasa Reddy, DNyavanandi, VKNanduri, SShiva Kumar, KKannan, MSrinivas, PNadipalli, PChaudhury, HSebastian, VJ Structure-activity relationship studies of novel pyrazole and imidazole carboxamides as cannabinoid-1 (CB1) antagonists. Bioorg Med Chem Lett21:4913-8 (2011) 
 
Potassium voltage-gated channel subfamily H member 2
Name:Potassium voltage-gated channel subfamily H member 2
Type:Multi-pass membrane protein
Mol. Mass.:126672.65
Organism:Homo sapiens (Human)
Description:Q12809
Residue:1159
BDBM21278
NameBDBM21278
Synonyms:5-(4-chlorophenyl)-1-(2,4-dichlorophenyl)-4-methyl-N-(piperidin-1-yl)-1H-pyrazole-3-carboxamide CHEMBL111 RIMONABANT HYDROCHLORIDE SR 141716A SR141716A [3H]SR141716A
TypeSmall organic molecule
Emp. Form.C22H21Cl3N4O
Mol. Mass.463.787
SMILESCc1c(nn(c1-c1ccc(Cl)cc1)-c1ccc(Cl)cc1Cl)C(=O)NN1CCCCC1