Reaction Details
TargetCarbonic anhydrase 2
LigandBDBM10867
Substrate/Competitorn/a
Meas. Tech.ChEMBL_762737 (CHEMBL1815988)
pH7.5±n/a
Ki 75.0±n/a nM
Commentsextracted
Citation Nishimori, IMinakuchi, TVullo, DScozzafava, ASupuran, CT Inhibition studies of theß-carbonic anhydrases from the bacterial pathogen Salmonella enterica serovar Typhimurium with sulfonamides and sulfamates. Bioorg Med Chem19:5023-30 (2011) 
 
Carbonic anhydrase 2
Name:Carbonic anhydrase 2
Type:Enzyme
Mol. Mass.:29250.71
Organism:Homo sapiens (Human)
Description:P00918
Residue:260
BDBM10867
NameBDBM10867
Synonyms:4-amino-6-chlorobenzene-1,3-disulfonamide aromatic/heteroaromatic sulfonamide 12
TypeSmall organic molecule
Emp. Form.C6H8ClN3O4S2
Mol. Mass.285.728
SMILESNc1cc(Cl)c(cc1S(N)(=O)=O)S(N)(=O)=O