Reaction Details
TargetCarbonic anhydrase 1
LigandBDBM13076
Substrate/Competitorn/a
Meas. Tech.ChEMBL_762736 (CHEMBL1815987)
pH7.5±n/a
Ki 328±n/a nM
Commentsextracted
Citation Nishimori, IMinakuchi, TVullo, DScozzafava, ASupuran, CT Inhibition studies of theß-carbonic anhydrases from the bacterial pathogen Salmonella enterica serovar Typhimurium with sulfonamides and sulfamates. Bioorg Med Chem19:5023-30 (2011) 
 
Carbonic anhydrase 1
Name:Carbonic anhydrase 1
Type:Enzyme
Mol. Mass.:28873.37
Organism:Homo sapiens (Human)
Description:P00915
Residue:261
BDBM13076
NameBDBM13076
Synonyms:6-chloro-1,1-dioxo-3,4-dihydro-2H-1,2,4-benzothiadiazine-7-sulfonamide Dichlothiazide Hydrochlorothiazide JFD00715 cid_3639
TypeSmall organic molecule
Emp. Form.C7H8ClN3O4S2
Mol. Mass.297.739
SMILESNS(=O)(=O)c1cc2c(NCNS2(=O)=O)cc1Cl