Reaction Details
TargetTranscriptional activator protein LuxR
LigandBDBM50350652
Substrate/Competitorn/a
Meas. Tech.ChEMBL_762416 (CHEMBL1816589)
IC50 9800±n/a nM
Citation Sabbah, MSoulère, LReverchon, SQueneau, YDoutheau, A LuxR dependent quorum sensing inhibition by N,N'-disubstituted imidazolium salts. Bioorg Med Chem19:4868-75 (2011) 
 
Transcriptional activator protein LuxR
Name:Transcriptional activator protein LuxR
Type:PROTEIN
Mol. Mass.:28563.86
Organism:Vibrio fischeri
Description:ChEMBL_831639
Residue:250
BDBM50350652
NameBDBM50350652
Synonyms:CHEMBL1813539
TypeSmall organic molecule
Emp. Form.C24H29Cl2N2
Mol. Mass.416.406
SMILESCCCCCCCCn1cc[n+](c1)C(c1ccc(Cl)cc1)c1ccc(Cl)cc1