Reaction Details
TargetTranscriptional activator protein LuxR
LigandBDBM50350659
Substrate/Competitorn/a
Meas. Tech.ChEMBL_762416 (CHEMBL1816589)
IC50 4000±n/a nM
Citation Sabbah, MSoulère, LReverchon, SQueneau, YDoutheau, A LuxR dependent quorum sensing inhibition by N,N'-disubstituted imidazolium salts. Bioorg Med Chem19:4868-75 (2011) 
 
Transcriptional activator protein LuxR
Name:Transcriptional activator protein LuxR
Type:PROTEIN
Mol. Mass.:28563.86
Organism:Vibrio fischeri
Description:ChEMBL_831639
Residue:250
BDBM50350659
NameBDBM50350659
Synonyms:CHEMBL1813551
TypeSmall organic molecule
Emp. Form.C26H33N2
Mol. Mass.373.5531
SMILESCCCCCCCCCCn1cc[n+](c1)C1c2ccccc2-c2ccccc12