Reaction Details
TargetTranscriptional activator protein LuxR
LigandBDBM50350670
Substrate/Competitorn/a
Meas. Tech.ChEMBL_762416 (CHEMBL1816589)
IC50 5300±n/a nM
Citation Sabbah, MSoulère, LReverchon, SQueneau, YDoutheau, A LuxR dependent quorum sensing inhibition by N,N'-disubstituted imidazolium salts. Bioorg Med Chem19:4868-75 (2011) 
 
Transcriptional activator protein LuxR
Name:Transcriptional activator protein LuxR
Type:PROTEIN
Mol. Mass.:28563.86
Organism:Vibrio fischeri
Description:ChEMBL_831639
Residue:250
BDBM50350670
NameBDBM50350670
Synonyms:CHEMBL1813559
TypeSmall organic molecule
Emp. Form.C24H45N2
Mol. Mass.361.627
n1cc[n+](c1)C1CCCC1