Reaction Details
Target5-hydroxytryptamine receptor 1A
LigandBDBM50351052
Substrate/Competitorn/a
Meas. Tech.ChEMBL_763995 (CHEMBL1820078)
Ki 784±n/a nM
Citation Pittalà, VSiracusa, MAModica, MNSalerno, LPedretti, AVistoli, GCagnotto, AMennini, TRomeo, G Synthesis and molecular modeling of 1H-pyrrolopyrimidine-2,4-dione derivatives as ligands for thea1-adrenoceptors. Bioorg Med Chem19:5260-76 (2011) 
 
5-hydroxytryptamine receptor 1A
Name:5-hydroxytryptamine receptor 1A
Type:G Protein-Coupled Receptor (GPCR)
Mol. Mass.:46445.29
Organism:Rattus norvegicus (rat)
Description:Binding assays were performed using rat hippocampal membranes.
Residue:422
BDBM50351052
NameBDBM50351052
Synonyms:CHEMBL1819466
TypeSmall organic molecule
Emp. Form.C32H33N5O4
Mol. Mass.551.6355
SMILESCOc1ccccc1N1CCN(CCn2c(=O)[nH]c3[nH]c(cc3c2=O)-c2ccc(OCc3ccccc3)cc2)CC1