Reaction Details
Target5-hydroxytryptamine receptor 1A
LigandBDBM50351058
Substrate/Competitorn/a
Meas. Tech.ChEMBL_763995 (CHEMBL1820078)
Ki 198±n/a nM
Citation Pittalà, VSiracusa, MAModica, MNSalerno, LPedretti, AVistoli, GCagnotto, AMennini, TRomeo, G Synthesis and molecular modeling of 1H-pyrrolopyrimidine-2,4-dione derivatives as ligands for thea1-adrenoceptors. Bioorg Med Chem19:5260-76 (2011) 
 
5-hydroxytryptamine receptor 1A
Name:5-hydroxytryptamine receptor 1A
Type:G Protein-Coupled Receptor (GPCR)
Mol. Mass.:46445.29
Organism:Rattus norvegicus (rat)
Description:Binding assays were performed using rat hippocampal membranes.
Residue:422
BDBM50351058
NameBDBM50351058
Synonyms:CHEMBL1819472
TypeSmall organic molecule
Emp. Form.C32H33N5O3
Mol. Mass.535.6361
SMILESCOc1ccccc1N1CCN(CCn2c(=O)n(Cc3ccccc3)c3[nH]c(cc3c2=O)-c2ccccc2)CC1