Reaction Details
Target5-hydroxytryptamine receptor 1A
LigandBDBM50351059
Substrate/Competitorn/a
Meas. Tech.ChEMBL_763995 (CHEMBL1820078)
Ki 1020±n/a nM
Citation Pittalà, VSiracusa, MAModica, MNSalerno, LPedretti, AVistoli, GCagnotto, AMennini, TRomeo, G Synthesis and molecular modeling of 1H-pyrrolopyrimidine-2,4-dione derivatives as ligands for thea1-adrenoceptors. Bioorg Med Chem19:5260-76 (2011) 
 
5-hydroxytryptamine receptor 1A
Name:5-hydroxytryptamine receptor 1A
Type:G Protein-Coupled Receptor (GPCR)
Mol. Mass.:46445.29
Organism:Rattus norvegicus (rat)
Description:Binding assays were performed using rat hippocampal membranes.
Residue:422
BDBM50351059
NameBDBM50351059
Synonyms:CHEMBL1819473
TypeSmall organic molecule
Emp. Form.C31H30ClN5O2
Mol. Mass.540.055
SMILESClc1ccccc1N1CCN(CCn2c(=O)n(Cc3ccccc3)c3[nH]c(cc3c2=O)-c2ccccc2)CC1