Reaction Details
Target5-hydroxytryptamine receptor 1A
LigandBDBM50351066
Substrate/Competitorn/a
Meas. Tech.ChEMBL_763995 (CHEMBL1820078)
Ki 13.4±n/a nM
Citation Pittalà, VSiracusa, MAModica, MNSalerno, LPedretti, AVistoli, GCagnotto, AMennini, TRomeo, G Synthesis and molecular modeling of 1H-pyrrolopyrimidine-2,4-dione derivatives as ligands for thea1-adrenoceptors. Bioorg Med Chem19:5260-76 (2011) 
 
5-hydroxytryptamine receptor 1A
Name:5-hydroxytryptamine receptor 1A
Type:G Protein-Coupled Receptor (GPCR)
Mol. Mass.:46445.29
Organism:Rattus norvegicus (rat)
Description:Binding assays were performed using rat hippocampal membranes.
Residue:422
BDBM50351066
NameBDBM50351066
Synonyms:CHEMBL1819456
TypeSmall organic molecule
Emp. Form.C25H27N5O3
Mol. Mass.445.5136
SMILESCOc1ccccc1N1CCN(CCn2c(=O)[nH]c3c(c[nH]c3c2=O)-c2ccccc2)CC1