Reaction Details
TargetCarbonic anhydrase 14
LigandBDBM50351138
Substrate/Competitorn/a
Meas. Tech.ChEMBL_764120 (CHEMBL1821331)
Ki 113±n/a nM
Citation Brzozowski, ZSlawinski, JGdaniec, MInnocenti, ASupuran, CT Carbonic anhydrase inhibitors. Synthesis, molecular structures, and inhibition of the human cytosolic isozymes I and II and transmembrane isozymes IX, XII (cancer-associated) and XIV with novel 3-pyridinesulfonamide derivatives. Eur J Med Chem46:4403-10 (2011) 
 
Carbonic anhydrase 14
Name:Carbonic anhydrase 14
Type:Enzyme
Mol. Mass.:37665.67
Organism:Homo sapiens (Human)
Description:Human (cloned) isozyme.
Residue:337
BDBM50351138
NameBDBM50351138
Synonyms:CHEMBL1817902
TypeSmall organic molecule
Emp. Form.C11H12N3O2S
Mol. Mass.250.296
SMILESCc1cccc[n+]1-c1ccncc1S(N)(=O)=O