Reaction Details
TargetCarbonic anhydrase 12
LigandBDBM50351136
Substrate/Competitorn/a
Meas. Tech.ChEMBL_764119 (CHEMBL1821330)
Ki 9.9±n/a nM
Citation Brzozowski, ZSlawinski, JGdaniec, MInnocenti, ASupuran, CT Carbonic anhydrase inhibitors. Synthesis, molecular structures, and inhibition of the human cytosolic isozymes I and II and transmembrane isozymes IX, XII (cancer-associated) and XIV with novel 3-pyridinesulfonamide derivatives. Eur J Med Chem46:4403-10 (2011) 
 
Carbonic anhydrase 12
Name:Carbonic anhydrase 12
Type:Enzyme
Mol. Mass.:39456.00
Organism:Homo sapiens (Human)
Description:Catalytic domain of human cloned isozyme was used in the assay
Residue:354
BDBM50351136
NameBDBM50351136
Synonyms:CHEMBL1817904
TypeSmall organic molecule
Emp. Form.C12H15N4O2S
Mol. Mass.279.338
SMILESC[N+](C)=c1ccn(cc1)-c1ccncc1S(N)(=O)=O