Reaction Details
TargetCarbonic anhydrase 12
LigandBDBM10882
Substrate/Competitorn/a
Meas. Tech.ChEMBL_764119 (CHEMBL1821330)
Ki 22±n/a nM
Citation Brzozowski, ZSlawinski, JGdaniec, MInnocenti, ASupuran, CT Carbonic anhydrase inhibitors. Synthesis, molecular structures, and inhibition of the human cytosolic isozymes I and II and transmembrane isozymes IX, XII (cancer-associated) and XIV with novel 3-pyridinesulfonamide derivatives. Eur J Med Chem46:4403-10 (2011) 
 
Carbonic anhydrase 12
Name:Carbonic anhydrase 12
Type:Enzyme
Mol. Mass.:39456.00
Organism:Homo sapiens (Human)
Description:Catalytic domain of human cloned isozyme was used in the assay
Residue:354
BDBM10882
NameBDBM10882
Synonyms:6-ethoxy-1,3-benzothiazole-2-sulfonamide Ethamide Ethoxzolamide Ethoxzolamide, EZM US10172837, Ethoxyzolamide | sulfonamide 3
TypeSmall organic molecule
Emp. Form.C9H10N2O3S2
Mol. Mass.258.317
SMILESCCOc1ccc2nc(sc2c1)S(N)(=O)=O