Reaction Details
TargetCarbonic anhydrase 9
LigandBDBM50351139
Substrate/Competitorn/a
Meas. Tech.ChEMBL_764118 (CHEMBL1821329)
Ki 7.6±n/a nM
Citation Brzozowski, ZSlawinski, JGdaniec, MInnocenti, ASupuran, CT Carbonic anhydrase inhibitors. Synthesis, molecular structures, and inhibition of the human cytosolic isozymes I and II and transmembrane isozymes IX, XII (cancer-associated) and XIV with novel 3-pyridinesulfonamide derivatives. Eur J Med Chem46:4403-10 (2011) 
 
Carbonic anhydrase 9
Name:Carbonic anhydrase 9
Type:Enzyme
Mol. Mass.:49669.03
Organism:Homo sapiens (Human)
Description:Catalytic domain of human cloned isozyme was used in the assay
Residue:459
BDBM50351139
NameBDBM50351139
Synonyms:CHEMBL1817901
TypeSmall organic molecule
Emp. Form.C10H10N3O2S
Mol. Mass.236.27
SMILESNS(=O)(=O)c1cnccc1-[n+]1ccccc1