Reaction Details
TargetCarbonic anhydrase 2
LigandBDBM50351142
Substrate/Competitorn/a
Meas. Tech.ChEMBL_764117 (CHEMBL1821328)
Ki 487±n/a nM
Citation Brzozowski, ZSlawinski, JGdaniec, MInnocenti, ASupuran, CT Carbonic anhydrase inhibitors. Synthesis, molecular structures, and inhibition of the human cytosolic isozymes I and II and transmembrane isozymes IX, XII (cancer-associated) and XIV with novel 3-pyridinesulfonamide derivatives. Eur J Med Chem46:4403-10 (2011) 
 
Carbonic anhydrase 2
Name:Carbonic anhydrase 2
Type:Enzyme
Mol. Mass.:29250.71
Organism:Homo sapiens (Human)
Description:P00918
Residue:260
BDBM50351142
NameBDBM50351142
Synonyms:CHEMBL1817907
TypeSmall organic molecule
Emp. Form.C10H9N3O3S
Mol. Mass.251.262
SMILESNS(=O)(=O)c1cnccc1-n1ccccc1=O