Reaction Details
TargetCarbonic anhydrase 2
LigandBDBM50351138
Substrate/Competitorn/a
Meas. Tech.ChEMBL_764117 (CHEMBL1821328)
Ki 336±n/a nM
Citation Brzozowski, ZSlawinski, JGdaniec, MInnocenti, ASupuran, CT Carbonic anhydrase inhibitors. Synthesis, molecular structures, and inhibition of the human cytosolic isozymes I and II and transmembrane isozymes IX, XII (cancer-associated) and XIV with novel 3-pyridinesulfonamide derivatives. Eur J Med Chem46:4403-10 (2011) 
 
Carbonic anhydrase 2
Name:Carbonic anhydrase 2
Type:Enzyme
Mol. Mass.:29250.71
Organism:Homo sapiens (Human)
Description:P00918
Residue:260
BDBM50351138
NameBDBM50351138
Synonyms:CHEMBL1817902
TypeSmall organic molecule
Emp. Form.C11H12N3O2S
Mol. Mass.250.296
SMILESCc1cccc[n+]1-c1ccncc1S(N)(=O)=O