Reaction Details
TargetCarbonic anhydrase 1
LigandBDBM50351136
Substrate/Competitorn/a
Meas. Tech.ChEMBL_764116 (CHEMBL1821327)
Ki 2910±n/a nM
Citation Brzozowski, ZSlawinski, JGdaniec, MInnocenti, ASupuran, CT Carbonic anhydrase inhibitors. Synthesis, molecular structures, and inhibition of the human cytosolic isozymes I and II and transmembrane isozymes IX, XII (cancer-associated) and XIV with novel 3-pyridinesulfonamide derivatives. Eur J Med Chem46:4403-10 (2011) 
 
Carbonic anhydrase 1
Name:Carbonic anhydrase 1
Type:Enzyme
Mol. Mass.:28873.37
Organism:Homo sapiens (Human)
Description:P00915
Residue:261
BDBM50351136
NameBDBM50351136
Synonyms:CHEMBL1817904
TypeSmall organic molecule
Emp. Form.C12H15N4O2S
Mol. Mass.279.338
SMILESC[N+](C)=c1ccn(cc1)-c1ccncc1S(N)(=O)=O