Reaction Details
TargetCarbonic anhydrase 14
LigandBDBM50326109
Substrate/Competitorn/a
Meas. Tech.ChEMBL_764120 (CHEMBL1821331)
Ki 93.8±n/a nM
Citation Brzozowski, ZSlawinski, JGdaniec, MInnocenti, ASupuran, CT Carbonic anhydrase inhibitors. Synthesis, molecular structures, and inhibition of the human cytosolic isozymes I and II and transmembrane isozymes IX, XII (cancer-associated) and XIV with novel 3-pyridinesulfonamide derivatives. Eur J Med Chem46:4403-10 (2011) 
 
Carbonic anhydrase 14
Name:Carbonic anhydrase 14
Type:Enzyme
Mol. Mass.:37665.67
Organism:Homo sapiens (Human)
Description:Human (cloned) isozyme.
Residue:337
BDBM50326109
NameBDBM50326109
Synonyms:1,4-Dihydro-4-oxo-1-(3-sulfamoylpyrid-4-yl)-3-pyridiensulfonamide | CHEMBL1242890
TypeSmall organic molecule
Emp. Form.C10H10N4O5S2
Mol. Mass.330.34
SMILESNS(=O)(=O)c1cnccc1-n1ccc(=O)c(c1)S(N)(=O)=O