Reaction Details
TargetBifunctional epoxide hydrolase 2
LigandBDBM50351239
Substrate/Competitorn/a
Meas. Tech.ChEMBL_763895 (CHEMBL1819920)
IC50 1.1±n/a nM
Citation Brown, JRNorth, EJHurdle, JGMorisseau, CScarborough, JSSun, DKorduláková, JScherman, MSJones, VGrzegorzewicz, ACrew, RMJackson, MMcNeil, MRLee, RE The structure-activity relationship of urea derivatives as anti-tuberculosis agents. Bioorg Med Chem19:5585-95 (2011) 
 
Bifunctional epoxide hydrolase 2
Name:Bifunctional epoxide hydrolase 2
Type:Enzyme
Mol. Mass.:62613.07
Organism:Homo sapiens (Human)
Description:P34913
Residue:555
BDBM50351239
NameBDBM50351239
Synonyms:CHEMBL1818393
TypeSmall organic molecule
Emp. Form.C18H21N3O
Mol. Mass.295.3788
SMILESO=C(NC1C2CC3CC(C2)CC1C3)Nc1ccc(cc1)C#N