Reaction Details
TargetBifunctional epoxide hydrolase 2
LigandBDBM50351243
Substrate/Competitorn/a
Meas. Tech.ChEMBL_763895 (CHEMBL1819920)
IC50 0.4±n/a nM
Citation Brown, JRNorth, EJHurdle, JGMorisseau, CScarborough, JSSun, DKorduláková, JScherman, MSJones, VGrzegorzewicz, ACrew, RMJackson, MMcNeil, MRLee, RE The structure-activity relationship of urea derivatives as anti-tuberculosis agents. Bioorg Med Chem19:5585-95 (2011) 
 
Bifunctional epoxide hydrolase 2
Name:Bifunctional epoxide hydrolase 2
Type:Enzyme
Mol. Mass.:62613.07
Organism:Homo sapiens (Human)
Description:P34913
Residue:555
BDBM50351243
NameBDBM50351243
Synonyms:CHEMBL1818389
TypeSmall organic molecule
Emp. Form.C17H21F3N2O
Mol. Mass.326.3566
SMILESCC1(C)C2CC1C(CNC(=O)Nc1ccc(F)c(F)c1F)CC2