Reaction Details
TargetKinesin-like protein KIF11
LigandBDBM50351255
Substrate/Competitorn/a
Meas. Tech.ChEMBL_764353 (CHEMBL1820905)
IC50 230±n/a nM
Citation Rodriguez, DRamesh, CHenson, LHWilmeth, LBryant, BKKadavakollu, SHirsch, RMontoya, JHowell, PRGeorge, JMAlexander, DJohnson, DLArterburn, JBShuster, CB Synthesis and characterization of tritylthioethanamine derivatives with potent KSP inhibitory activity. Bioorg Med Chem19:5446-53 (2011) 
 
Kinesin-like protein KIF11
Name:Kinesin-like protein KIF11
Type:PROTEIN
Mol. Mass.:119138.97
Organism:Homo sapiens (Human)
Description:ChEMBL_1457426
Residue:1056
BDBM50351255
NameBDBM50351255
Synonyms:CHEMBL1818525
TypeSmall organic molecule
Emp. Form.C23H23NO3S
Mol. Mass.393.499
SMILESCOc1ccc(cc1)C(SC[C@@H](N)C(O)=O)(c1ccccc1)c1ccccc1