Reaction Details
TargetProstaglandin E2 receptor EP2 subtype
LigandBDBM50351482
Substrate/Competitorn/a
Meas. Tech.ChEMBL_764671 (CHEMBL1821223)
Ki 62±n/a nM
Citation Iwahashi, MTakahashi, ETanaka, MMatsunaga, YOkada, YMatsumoto, RNambu, FNakai, HToda, M Design and synthesis of new prostaglandin D2 receptor antagonists. Bioorg Med Chem19:5361-71 (2011) 
 
Prostaglandin E2 receptor EP2 subtype
Name:Prostaglandin E2 receptor EP2 subtype
Type:G-protein coupled receptor
Mol. Mass.:40495.26
Organism:Mus musculus (Mouse)
Description:n/a
Residue:362
BDBM50351482
NameBDBM50351482
Synonyms:CHEMBL1819612
TypeSmall organic molecule
Emp. Form.C27H28N2O5
Mol. Mass.460.5216
SMILESCN1C[C@@H](COc2ccc(C(=O)Nc3cc(C)cc(CC(O)=O)c3)c(C)c2)Oc2ccccc12