Reaction Details
TargetProstacyclin receptor
LigandBDBM50351482
Substrate/Competitorn/a
Meas. Tech.ChEMBL_764674 (CHEMBL1821226)
Ki 3500±n/a nM
Citation Iwahashi, MTakahashi, ETanaka, MMatsunaga, YOkada, YMatsumoto, RNambu, FNakai, HToda, M Design and synthesis of new prostaglandin D2 receptor antagonists. Bioorg Med Chem19:5361-71 (2011) 
 
Prostacyclin receptor
Name:Prostacyclin receptor
Type:G Protein-Coupled Receptor (GPCR)
Mol. Mass.:40968.22
Organism:Homo sapiens (Human)
Description:The membranes prepared from human platelet were used in binding assay.
Residue:386
BDBM50351482
NameBDBM50351482
Synonyms:CHEMBL1819612
TypeSmall organic molecule
Emp. Form.C27H28N2O5
Mol. Mass.460.5216
SMILESCN1C[C@@H](COc2ccc(C(=O)Nc3cc(C)cc(CC(O)=O)c3)c(C)c2)Oc2ccccc12