Reaction Details
TargetProstaglandin D2 receptor
LigandBDBM50351486
Substrate/Competitorn/a
Meas. Tech.ChEMBL_764675 (CHEMBL1821227)
Ki 16±n/a nM
Citation Iwahashi, MTakahashi, ETanaka, MMatsunaga, YOkada, YMatsumoto, RNambu, FNakai, HToda, M Design and synthesis of new prostaglandin D2 receptor antagonists. Bioorg Med Chem19:5361-71 (2011) 
 
Prostaglandin D2 receptor
Name:Prostaglandin D2 receptor
Type:PROTEIN
Mol. Mass.:40018.63
Organism:Mus musculus
Description:ChEMBL_788408
Residue:357
BDBM50351486
NameBDBM50351486
Synonyms:CHEMBL1819609
TypeSmall organic molecule
Emp. Form.C25H23ClN2O5
Mol. Mass.466.914
SMILESCN1C[C@@H](COc2ccc(C(=O)Nc3cccc(CC(O)=O)c3)c(Cl)c2)Oc2ccccc12