Reaction Details
TargetAutoinducer 1 sensor kinase/phosphatase LuxN
LigandBDBM50351499
Substrate/Competitorn/a
Meas. Tech.ChEMBL_765226 (CHEMBL1827779)
IC50 62300±n/a nM
Citation Lowery, CASalzameda, NTSawada, DKaufmann, GFJanda, KD Medicinal chemistry as a conduit for the modulation of quorum sensing. J Med Chem53:7467-89 (2010) 
 
Autoinducer 1 sensor kinase/phosphatase LuxN
Name:Autoinducer 1 sensor kinase/phosphatase LuxN
Type:PROTEIN
Mol. Mass.:96099.26
Organism:Vibrio harveyi
Description:ChEMBL_765226
Residue:849
BDBM50351499
NameBDBM50351499
Synonyms:CHEMBL1823950
TypeSmall organic molecule
Emp. Form.C12H14N2O2S
Mol. Mass.250.317
SMILESCC(C)OC(=O)CSc1nc2ccccc2[nH]1