Reaction Details
TargetAutoinducer 1 sensor kinase/phosphatase LuxN
LigandBDBM50351500
Substrate/Competitorn/a
Meas. Tech.ChEMBL_765226 (CHEMBL1827779)
IC50 2400±n/a nM
Citation Lowery, CASalzameda, NTSawada, DKaufmann, GFJanda, KD Medicinal chemistry as a conduit for the modulation of quorum sensing. J Med Chem53:7467-89 (2010) 
 
Autoinducer 1 sensor kinase/phosphatase LuxN
Name:Autoinducer 1 sensor kinase/phosphatase LuxN
Type:PROTEIN
Mol. Mass.:96099.26
Organism:Vibrio harveyi
Description:ChEMBL_765226
Residue:849
BDBM50351500
NameBDBM50351500
Synonyms:CHEMBL1823949
TypeSmall organic molecule
Emp. Form.C22H27NO2
Mol. Mass.337.4553
SMILESCC(C)(c1ccccc1)c1ccc(OCC(=O)NC2CCCC2)cc1