Reaction Details
TargetAutoinducer 1 sensor kinase/phosphatase LuxN
LigandBDBM50351503
Substrate/Competitorn/a
Meas. Tech.ChEMBL_765226 (CHEMBL1827779)
IC50 2700±n/a nM
Citation Lowery, CASalzameda, NTSawada, DKaufmann, GFJanda, KD Medicinal chemistry as a conduit for the modulation of quorum sensing. J Med Chem53:7467-89 (2010) 
 
Autoinducer 1 sensor kinase/phosphatase LuxN
Name:Autoinducer 1 sensor kinase/phosphatase LuxN
Type:PROTEIN
Mol. Mass.:96099.26
Organism:Vibrio harveyi
Description:ChEMBL_765226
Residue:849
BDBM50351503
NameBDBM50351503
Synonyms:CHEMBL1823946
TypeSmall organic molecule
Emp. Form.C23H28ClN3O4S
Mol. Mass.478.004
SMILESCC(C)CC(NS(=O)(=O)c1ccc2CCN(C(C)=O)c2c1)C(=O)NCc1ccc(Cl)cc1