Reaction Details
TargetTranscriptional activator protein TraR
LigandBDBM50266163
Substrate/Competitorn/a
Meas. Tech.ChEMBL_765233 (CHEMBL1827786)
IC50 1250±n/a nM
Citation Lowery, CASalzameda, NTSawada, DKaufmann, GFJanda, KD Medicinal chemistry as a conduit for the modulation of quorum sensing. J Med Chem53:7467-89 (2010) 
 
Transcriptional activator protein TraR
Name:Transcriptional activator protein TraR
Type:PROTEIN
Mol. Mass.:26741.83
Organism:Rhizobium radiobacter
Description:ChEMBL_765233
Residue:234
BDBM50266163
NameBDBM50266163
Synonyms:(S)-2-(4-iodophenyl)-N-(2-oxotetrahydrofuran-3-yl)acetamide | CHEMBL468790
TypeSmall organic molecule
Emp. Form.C12H12INO3
Mol. Mass.345.1331
SMILESIc1ccc(CC(=O)N[C@H]2CCOC2=O)cc1