Reaction Details
TargetTranscriptional activator protein LasR
LigandBDBM50351510
Substrate/Competitorn/a
Meas. Tech.ChEMBL_765284 (CHEMBL1827923)
EC50 15±n/a nM
Citation Lowery, CASalzameda, NTSawada, DKaufmann, GFJanda, KD Medicinal chemistry as a conduit for the modulation of quorum sensing. J Med Chem53:7467-89 (2010) 
 
Transcriptional activator protein LasR
Name:Transcriptional activator protein LasR
Type:PROTEIN
Mol. Mass.:26618.24
Organism:Pseudomonas aeruginosa
Description:ChEMBL_1475312
Residue:239
BDBM50351510
NameBDBM50351510
Synonyms:CHEMBL8463
TypeSmall organic molecule
Emp. Form.C18H31NO4
Mol. Mass.325.443
SMILESCCCCCCCCCCCC(=O)CC(=O)N[C@H]1CCOC1=O