Reaction Details
TargetTranscriptional activator protein LasR
LigandBDBM50351513
Substrate/Competitorn/a
Meas. Tech.ChEMBL_765284 (CHEMBL1827923)
EC50 15±n/a nM
Citation Lowery, CASalzameda, NTSawada, DKaufmann, GFJanda, KD Medicinal chemistry as a conduit for the modulation of quorum sensing. J Med Chem53:7467-89 (2010) 
 
Transcriptional activator protein LasR
Name:Transcriptional activator protein LasR
Type:PROTEIN
Mol. Mass.:26618.24
Organism:Pseudomonas aeruginosa
Description:ChEMBL_1475312
Residue:239
BDBM50351513
NameBDBM50351513
Synonyms:CHEMBL8450
TypeSmall organic molecule
Emp. Form.C14H23NO4
Mol. Mass.269.3367
SMILESCCCCCCCC(=O)CC(=O)N[C@H]1CCOC1=O