Reaction Details
TargetRicin
LigandBDBM6645
Substrate/Competitorn/a
Meas. Tech.ChEMBL_764841 (CHEMBL1826784)
IC50 600000±n/a nM
Citation Pruet, JMJasheway, KRManzano, LABai, YAnslyn, EVRobertus, JD 7-Substituted pterins provide a new direction for ricin A chain inhibitors. Eur J Med Chem46:3608-15 (2011) 
 
Ricin
Name:Ricin
Synonyms:RICI_RICCO
Type:PROTEIN
Mol. Mass.:64090.82
Organism:Ricinus communis
Description:ChEMBL_1286970
Residue:576
BDBM6645
NameBDBM6645
TypeSmall organic molecule
Emp. Form.C14H12N6O3
Mol. Mass.312.2835
SMILESNc1nc2ncc(CNc3ccc(cc3)C(O)=O)nc2c(=O)[nH]1