Reaction Details
TargetRicin
LigandBDBM50351576
Substrate/Competitorn/a
Meas. Tech.ChEMBL_764841 (CHEMBL1826784)
IC50 700000±n/a nM
Citation Pruet, JMJasheway, KRManzano, LABai, YAnslyn, EVRobertus, JD 7-Substituted pterins provide a new direction for ricin A chain inhibitors. Eur J Med Chem46:3608-15 (2011) 
 
Ricin
Name:Ricin
Synonyms:RICI_RICCO
Type:PROTEIN
Mol. Mass.:64090.82
Organism:Ricinus communis
Description:ChEMBL_1286970
Residue:576
BDBM50351576
NameBDBM50351576
Synonyms:CHEMBL1825016
TypeSmall organic molecule
Emp. Form.C9H9N5O2
Mol. Mass.219.2001
SMILESCCC(=O)c1cnc2c(nc(N)[nH]c2=O)n1