Reaction Details
TargetTyrosine-protein phosphatase non-receptor type 6
LigandBDBM50351780
Substrate/Competitorn/a
Meas. Tech.ChEMBL_765400 (CHEMBL1828248)
pH8±n/a
IC50 2430±n/a nM
Commentsextracted
Citation Sun, LPShen, QPiao, HHMa, WPGao, LXZhang, WNan, FJLi, JPiao, HR Synthesis and biological evaluation of (±)-3-(2-(2-fluorobenzyloxy) naphthalen-6-yl)-2-aminopropanoic acid derivatives as novel PTP1B inhibitors. Eur J Med Chem46:3630-8 (2011) 
 
Tyrosine-protein phosphatase non-receptor type 6
Name:Tyrosine-protein phosphatase non-receptor type 6
Type:Protein
Mol. Mass.:67570.41
Organism:Homo sapiens (Human)
Description:P29350
Residue:595
BDBM50351780
NameBDBM50351780
Synonyms:CHEMBL1823762
TypeSmall organic molecule
Emp. Form.C29H23ClFNO4
Mol. Mass.503.949
SMILESOC(=O)C(Cc1ccc2cc(OCc3ccccc3F)ccc2c1)NC(=O)\C=C\c1ccccc1Cl