Reaction Details
TargetTyrosine-protein phosphatase non-receptor type 2
LigandBDBM50351782
Substrate/Competitorn/a
Meas. Tech.ChEMBL_765398 (CHEMBL1828246)
IC50 4330±n/a nM
Citation Sun, LPShen, QPiao, HHMa, WPGao, LXZhang, WNan, FJLi, JPiao, HR Synthesis and biological evaluation of (±)-3-(2-(2-fluorobenzyloxy) naphthalen-6-yl)-2-aminopropanoic acid derivatives as novel PTP1B inhibitors. Eur J Med Chem46:3630-8 (2011) 
 
Tyrosine-protein phosphatase non-receptor type 2
Name:Tyrosine-protein phosphatase non-receptor type 2
Type:Protein
Mol. Mass.:48481.80
Organism:Homo sapiens (Human)
Description:P17706
Residue:415
BDBM50351782
NameBDBM50351782
Synonyms:CHEMBL1823956
TypeSmall organic molecule
Emp. Form.C29H23ClFNO4
Mol. Mass.503.949
SMILESOC(=O)C(Cc1ccc2cc(OCc3ccccc3F)ccc2c1)NC(=O)\C=C\c1ccc(Cl)cc1