Reaction Details
TargetPhosphatidylinositol 4,5-bisphosphate 3-kinase catalytic subunit alpha isoform
LigandBDBM50343200
Substrate/Competitorn/a
Meas. Tech.ChEMBL_766021 (CHEMBL1828259)
Ki 1.2±n/a nM
Citation Stec, MMAndrews, KLBooker, SKCaenepeel, SFreeman, DJJiang, JLiao, HMcCarter, JMullady, ELSan Miguel, TSubramanian, RTamayo, NWang, LYang, KZalameda, LPZhang, NHughes, PENorman, MH Structure-activity relationships of phosphoinositide 3-kinase (PI3K)/mammalian target of rapamycin (mTOR) dual inhibitors: investigations of various 6,5-heterocycles to improve metabolic stability. J Med Chem54:5174-84 (2011) 
 
Phosphatidylinositol 4,5-bisphosphate 3-kinase catalytic subunit alpha isoform
Name:Phosphatidylinositol 4,5-bisphosphate 3-kinase catalytic subunit alpha isoform
Type:Enzyme Subunit
Mol. Mass.:124294.87
Organism:Homo sapiens (Human)
Description:P42336
Residue:1068
BDBM50343200
NameBDBM50343200
Synonyms:CHEMBL1615189 N-[6-(6-chloro-5-{[(4-fluorophenyl)sulfonyl]amino}pyridin-3-yl)-1,3-benzothiazol-2-yl]acetamide
TypeSmall organic molecule
Emp. Form.C20H14ClFN4O3S2
Mol. Mass.476.932
SMILESCC(=O)Nc1nc2ccc(cc2s1)-c1cnc(Cl)c(NS(=O)(=O)c2ccc(F)cc2)c1