Reaction Details
TargetPhosphatidylinositol 4,5-bisphosphate 3-kinase catalytic subunit delta isoform
LigandBDBM50351949
Substrate/Competitorn/a
Meas. Tech.ChEMBL_766100 (CHEMBL1826067)
Ki 0.8±n/a nM
Citation Stec, MMAndrews, KLBooker, SKCaenepeel, SFreeman, DJJiang, JLiao, HMcCarter, JMullady, ELSan Miguel, TSubramanian, RTamayo, NWang, LYang, KZalameda, LPZhang, NHughes, PENorman, MH Structure-activity relationships of phosphoinositide 3-kinase (PI3K)/mammalian target of rapamycin (mTOR) dual inhibitors: investigations of various 6,5-heterocycles to improve metabolic stability. J Med Chem54:5174-84 (2011) 
 
Phosphatidylinositol 4,5-bisphosphate 3-kinase catalytic subunit delta isoform
Name:Phosphatidylinositol 4,5-bisphosphate 3-kinase catalytic subunit delta isoform
Type:Enzyme Subunit
Mol. Mass.:119489.41
Organism:Homo sapiens (Human)
Description:O00329
Residue:1044
BDBM50351949
NameBDBM50351949
Synonyms:CHEMBL1822054
TypeSmall organic molecule
Emp. Form.C19H14ClFN6O3S
Mol. Mass.460.869
SMILESCC(=O)Nc1cn2nc(ccc2n1)-c1cnc(Cl)c(NS(=O)(=O)c2ccc(F)cc2)c1