Reaction Details
TargetSigma non-opioid intracellular receptor 1
LigandBDBM50351965
Substrate/Competitorn/a
Meas. Tech.ChEMBL_765939 (CHEMBL1827955)
Ki 4±n/a nM
Citation Wang, WCui, JLu, XPadakanti, PKXu, JParsons, SMLuedtke, RRRath, NPTu, Z Synthesis and in vitro biological evaluation of carbonyl group-containing analogues fors1 receptors. J Med Chem54:5362-72 (2011) 
 
Sigma non-opioid intracellular receptor 1
Name:Sigma non-opioid intracellular receptor 1
Type:Protein
Mol. Mass.:25307.17
Organism:Cavia porcellus (Guinea pig)
Description:Q60492
Residue:223
BDBM50351965
NameBDBM50351965
Synonyms:CHEMBL1822387
TypeSmall organic molecule
Emp. Form.C25H31FN2O3
Mol. Mass.426.5236
SMILESCOc1ccc(CN2CC[C@@H]([C@@H](O)C2)N2CCC(CC2)C(=O)c2ccc(F)cc2)cc1