Reaction Details
TargetSigma non-opioid intracellular receptor 1
LigandBDBM50351970
Substrate/Competitorn/a
Meas. Tech.ChEMBL_765939 (CHEMBL1827955)
Ki 4.1±n/a nM
Citation Wang, WCui, JLu, XPadakanti, PKXu, JParsons, SMLuedtke, RRRath, NPTu, Z Synthesis and in vitro biological evaluation of carbonyl group-containing analogues fors1 receptors. J Med Chem54:5362-72 (2011) 
 
Sigma non-opioid intracellular receptor 1
Name:Sigma non-opioid intracellular receptor 1
Type:Protein
Mol. Mass.:25307.17
Organism:Cavia porcellus (Guinea pig)
Description:Q60492
Residue:223
BDBM50351970
NameBDBM50351970
Synonyms:CHEMBL1822392
TypeSmall organic molecule
Emp. Form.C25H32N2O3
Mol. Mass.408.5332
SMILESCOc1ccc(cc1)C(=O)C1CCN(CC1)[C@H]1CCN(Cc2ccccc2)C[C@@H]1O