Reaction Details
TargetTyrosine-protein phosphatase non-receptor type 1
LigandBDBM50336491
Substrate/Competitorn/a
Meas. Tech.ChEMBL_766201 (CHEMBL1826221)
IC50>100000±n/a nM
Citation Li, CHe, XPZhang, YJLi, ZGao, LXShi, XXXie, JLi, JChen, GRTang, Y Click to a focused library of benzyl 6-triazolo(hydroxy)benzoic glucosides: novel construction of PTP1B inhibitors on a sugar scaffold. Eur J Med Chem46:4212-8 (2011) 
 
Tyrosine-protein phosphatase non-receptor type 1
Name:Tyrosine-protein phosphatase non-receptor type 1
Type:Protein phosphatase
Mol. Mass.:49963.76
Organism:Homo sapiens (Human)
Description:Human recombinant GST-fusion PTP1B (1-435).
Residue:435
BDBM50336491
NameBDBM50336491
Synonyms:3-Hydroxy-benzoic acid 3-Hydroxybenzoate, II CHEMBL65369
TypeSmall organic molecule
Emp. Form.C7H6O3
Mol. Mass.138.1207
SMILESOC(=O)c1cccc(O)c1