Reaction Details
Target3-dehydroquinate dehydratase
LigandBDBM50352023
Substrate/Competitorn/a
Meas. Tech.ChEMBL_766424 (CHEMBL1826564)
Ki 14600±n/a nM
Citation Tizón, LOtero, JMPrazeres, VFLlamas-Saiz, ALFox, GCvan Raaij, MJLamb, HHawkins, ARAinsa, JACastedo, LGonzález-Bello, C A prodrug approach for improving antituberculosis activity of potent Mycobacterium tuberculosis type II dehydroquinase inhibitors. J Med Chem54:6063-84 (2011) 
 
3-dehydroquinate dehydratase
Name:3-dehydroquinate dehydratase
Type:PROTEIN
Mol. Mass.:18479.08
Organism:Helicobacter pylori
Description:ChEMBL_766424
Residue:167
BDBM50352023
NameBDBM50352023
Synonyms:CHEMBL1823567
TypeSmall organic molecule
Emp. Form.C17H17O6S2
Mol. Mass.381.444
SMILESO[C@@H]1C[C@](O)(C([O-])=O)C(Cc2cccs2)=C(OCc2cccs2)[C@H]1O