Reaction Details
Target3-dehydroquinate dehydratase
LigandBDBM50352026
Substrate/Competitorn/a
Meas. Tech.ChEMBL_766424 (CHEMBL1826564)
Ki 279±n/a nM
Citation Tizón, LOtero, JMPrazeres, VFLlamas-Saiz, ALFox, GCvan Raaij, MJLamb, HHawkins, ARAinsa, JACastedo, LGonzález-Bello, C A prodrug approach for improving antituberculosis activity of potent Mycobacterium tuberculosis type II dehydroquinase inhibitors. J Med Chem54:6063-84 (2011) 
 
3-dehydroquinate dehydratase
Name:3-dehydroquinate dehydratase
Type:PROTEIN
Mol. Mass.:18479.08
Organism:Helicobacter pylori
Description:ChEMBL_766424
Residue:167
BDBM50352026
NameBDBM50352026
Synonyms:CHEMBL1823570
TypeSmall organic molecule
Emp. Form.C22H21O6S2
Mol. Mass.445.529
SMILESCc1ccc2sc(CC3=C(OCc4cccs4)[C@@H](O)[C@H](O)C[C@]3(O)C([O-])=O)cc2c1