Reaction Details
TargetHistamine H3 receptor
LigandBDBM50352080
Substrate/Competitorn/a
Meas. Tech.ChEMBL_766550 (CHEMBL1827031)
Ki 0.53±n/a nM
Citation Labeeuw, OLevoin, NPoupardin-Olivier, OCalmels, TLigneau, XBerrebi-Bertrand, IRobert, PLecomte, JMSchwartz, JCCapet, M Novel and highly potent histamine H3 receptor ligands. Part 2: exploring the cyclohexylamine-based series. Bioorg Med Chem Lett21:5384-8 (2011) 
 
Histamine H3 receptor
Name:Histamine H3 receptor
Type:G Protein-Coupled Receptor (GPCR)
Mol. Mass.:48691.47
Organism:Homo sapiens (Human)
Description:Binding assays were using CHO cells stably expressing hH3R receptors.
Residue:445
BDBM50352080
NameBDBM50352080
Synonyms:CHEMBL1824248
TypeSmall organic molecule
Emp. Form.C24H40N2O
Mol. Mass.372.5872
SMILESCCCCN[C@H]1CC[C@H](CC1)c1ccc(OCCCN2CCCCC2)cc1