Reaction Details
TargetHistamine H3 receptor
LigandBDBM50352087
Substrate/Competitorn/a
Meas. Tech.ChEMBL_766550 (CHEMBL1827031)
Ki 0.41±n/a nM
Citation Labeeuw, OLevoin, NPoupardin-Olivier, OCalmels, TLigneau, XBerrebi-Bertrand, IRobert, PLecomte, JMSchwartz, JCCapet, M Novel and highly potent histamine H3 receptor ligands. Part 2: exploring the cyclohexylamine-based series. Bioorg Med Chem Lett21:5384-8 (2011) 
 
Histamine H3 receptor
Name:Histamine H3 receptor
Type:G Protein-Coupled Receptor (GPCR)
Mol. Mass.:48691.47
Organism:Homo sapiens (Human)
Description:Binding assays were using CHO cells stably expressing hH3R receptors.
Residue:445
BDBM50352087
NameBDBM50352087
Synonyms:CHEMBL1824244
TypeSmall organic molecule
Emp. Form.C28H38N2O
Mol. Mass.418.6141
SMILESC(COc1ccc(cc1)[C@@H]1CC[C@@H](CC1)N1Cc2ccccc2C1)CN1CCCCC1