Reaction Details
TargetHistamine H3 receptor
LigandBDBM50352095
Substrate/Competitorn/a
Meas. Tech.ChEMBL_766550 (CHEMBL1827031)
Ki 0.25±n/a nM
Citation Labeeuw, OLevoin, NPoupardin-Olivier, OCalmels, TLigneau, XBerrebi-Bertrand, IRobert, PLecomte, JMSchwartz, JCCapet, M Novel and highly potent histamine H3 receptor ligands. Part 2: exploring the cyclohexylamine-based series. Bioorg Med Chem Lett21:5384-8 (2011) 
 
Histamine H3 receptor
Name:Histamine H3 receptor
Type:G Protein-Coupled Receptor (GPCR)
Mol. Mass.:48691.47
Organism:Homo sapiens (Human)
Description:Binding assays were using CHO cells stably expressing hH3R receptors.
Residue:445
BDBM50352095
NameBDBM50352095
Synonyms:CHEMBL1824235
TypeSmall organic molecule
Emp. Form.C24H38N2O
Mol. Mass.370.5713
SMILESC(COc1ccc(cc1)[C@H]1CC[C@@H](CC1)N1CCCC1)CN1CCCCC1